Target
5-hydroxytryptamine receptor 5A
Ligand
BDBM81498
Substrate
Ki
316.22±n/a nM
Comments
PDSP_1643
Citation
 Matthes, HBoschert, UAmlaiky, NGrailhe, RPlassat, JLMuscatelli, FMattei, MGHen, R Mouse 5-hydroxytryptamine5A and 5-hydroxytryptamine5B receptors define a new family of serotonin receptors: cloning, functional expression, and chromosomal localization. Mol Pharmacol 43:313-9 (1993) Target
Name:
5-hydroxytryptamine receptor 5A
Synonyms:
5-HT-5 5-HT5 5-hydroxytryptamine receptor 5A 5ht5a Serotonin 5a (5-HT5a) receptor | Serotonin receptor 5A
Type:
Enzyme Catalytic Domain
Mol. Mass.:
40749.33
Organism:
MOUSE
Description:
5-HT5 0 MOUSE::P30966
Residue:
357
  
Inhibitor
Name:
BDBM81498
Synonyms:
5-Methoxy-3-(1,2,3,6-tetrahydro-pyridin-4-yl)-1H-indole(RU-24969) CHEMBL18785 RU 24969
Type:
Small organic molecule
Emp. Form.:
C14H16N2O
Mol. Mass.:
228.2896
SMILES:
COc1ccc2[nH]cc(C3=CCNCC3)c2c1
: