Target
Casein kinase I isoform delta
Ligand
BDBM274718
Substrate
Meas. Tech.
Kinase Assay
pH
7.4±n/a
Temperature
298.15±n/a K
IC50
0.109±n/a nM
Comments
extracted
Citation
 Velaparthi, UDarne, CPDodd, DSSampognaro, AJWittman, MDKumaravel, SMullick, DLiu, PRachamreddy, CR Substituted imidazoles as casein kinase 1 D/E inhibitors US Patent  US9556179 Publication Date 1/31/2017 
Target
Name:
Casein kinase I isoform delta
Synonyms:
CKI-delta CSNK1D Casein kinase I delta Casein kinase I isoform delta (CK1D) KC1D_HUMAN | casein kinases 1 delta (CK1 delta)
Type:
Enzyme
Mol. Mass.:
47356.76
Organism:
Homo sapiens (Human)
Description:
P48730
Residue:
415
  
Inhibitor
Name:
BDBM274718
Synonyms:
N-(6-(4-(4-chlorophenyl)-1-(2- fluoroethyl)-2-methyl-1H-imidazol- 5-yl)imidazo[1,2-b]pyridazin-2-yl)- 2-fluoroisonicotinamide | US9556179, Compound 293
Type:
Small organic molecule
Emp. Form.:
C24H18ClF2N7O
Mol. Mass.:
493.896
SMILES:
Cc1nc(c(-c2ccc3nc(NC(=O)c4ccnc(F)c4)cn3n2)n1CCF)-c1ccc(Cl)cc1
: