Target
5-hydroxytryptamine receptor 1B
Ligand
BDBM84952
Substrate
Ki
2089.30±n/a nM
Comments
PDSP_3125
Citation
 Borsini, FGiraldo, EMonferini, EAntonini, GParenti, MBietti, GDonetti, A BIMT 17, a 5-HT2A receptor antagonist and 5-HT1A receptor full agonist in rat cerebral cortex. Naunyn Schmiedebergs Arch Pharmacol 352:276-82 (1995)  
Target
Name:
5-hydroxytryptamine receptor 1B
Synonyms:
5-HT-1B 5-hydroxytryptamine receptor 1B (5HT1B) 5ht1b Serotonin 1 (5-HT1) receptor Serotonin receptor 1B
Type:
Protein
Mol. Mass.:
43173.33
Organism:
Rattus norvegicus (Rat)
Description:
P28564
Residue:
386
  
Inhibitor
Name:
BDBM84952
Synonyms:
BIMT 17 NSC_127941
Type:
Small organic molecule
Emp. Form.:
C20H21F3N4O
Mol. Mass.:
390.4021
SMILES:
FC(F)(F)c1ccc(cc1)N1CCN(CCn2c3ccccc3[nH]c2=O)CC1
: