Target
Substance-P receptor
Ligand
BDBM84954
Substrate
Ki
228±n/a nM
Comments
PDSP_823
Citation
 Kudlacz, EMShatzer, SAKnippenberg, RWLogan, DEPoirot, Mvan Giersbergen, PLBurkholder, TP In vitro and in vivo characterization of MDL 105,212A, a nonpeptide NK-1/NK-2 tachykinin receptor antagonist. J Pharmacol Exp Ther 277:840-51 (1996) Target
Name:
Substance-P receptor
Synonyms:
NK-1 receptor NK1 Receptor Neurokinin 1 receptor SPR Tac1r Tacr1
Type:
G Protein-Coupled Receptor (GPCR)
Mol. Mass.:
46371.54
Organism:
Rattus norvegicus (rat)
Description:
Competition binding assays were carried out using membrane preparations from transfected CHO cells that constitutively expressed the rat NK1 receptor.
Residue:
407
  
Inhibitor
Name:
BDBM84954
Synonyms:
CAS_6437864 NSC_6437864
Type:
Small organic molecule
Emp. Form.:
C54H72N8O13
Mol. Mass.:
1041.1953
SMILES:
CCCCCc1ccccc1CCC(=O)NC1C(C)OC(=O)C(CO)NC(=O)C(CC(N)=O)NC(=O)C(NC(=O)C(Cc2ccccc2)NC(=O)C(CC(C)C)NC(=O)C(=Cc2ccc(O)cc2)N(C)C1=O)C(C)O
: