Target
Metabotropic glutamate receptor 3
Ligand
BDBM50004899
Substrate
Ki
2100±n/a nM
Comments
PDSP_2016
Citation
 Flor, PJGomeza, JTones, MAKuhn, RPin, JPKnöpfel, T The C-terminal domain of the mGluR1 metabotropic glutamate receptor affects sensitivity to agonists. J Neurochem 67:58-63 (1996)  
Target
Name:
Metabotropic glutamate receptor 3
Synonyms:
GPRC1C GRM3_HUMAN metabotropic glutamate 3 metabotropic glutamate 3/1c
Type:
Enzyme Catalytic Domain
Mol. Mass.:
98889.09
Organism:
Homo sapiens (Human)
Description:
metabotropic glutamate 1c 0 HUMAN::Q14832
Residue:
879
  
Inhibitor
Name:
BDBM50004899
Synonyms:
(1R,2S)-2-((S)-Amino-carboxy-methyl)-cyclopropanecarboxylic acid CHEMBL285369 L-CCG-IV
Type:
Small organic molecule
Emp. Form.:
C6H9NO4
Mol. Mass.:
159.14
SMILES:
N[C@@H]([C@H]1C[C@H]1C(O)=O)C(O)=O
: