Target
5-hydroxytryptamine receptor 2C
Ligand
BDBM82272
Substrate
Ki
100±n/a nM
Comments
PDSP_7268
Citation
 Baxter, GS Novel discriminatory ligands for 5-HT2B receptors. Behav Brain Res 73:149-52 (1996)  
Target
Name:
5-hydroxytryptamine receptor 2C
Synonyms:
5-HT-1C 5-HT1C 5-HT2C-INI 5-HTR2C 5-hydroxytryptamine receptor 2C (5-HT-2C) 5HT-1C HTR1C Serotonin (5-HT3) receptor Serotonin Receptor 2C
Type:
G Protein-Coupled Receptor (GPCR)
Mol. Mass.:
51836.79
Organism:
Homo sapiens (Human)
Description:
P28335
Residue:
458
  
Inhibitor
Name:
BDBM82272
Synonyms:
SB 200646 | SB200646a
Type:
Emp. Form.:
C15H14N4O
Mol. Mass.:
266.2979
SMILES:
Cn1ccc2cc(NC(=O)Nc3cccnc3)ccc12
: