Target
Metabotropic glutamate receptor 4
Ligand
BDBM50004863
Substrate
Ki
>10000±n/a nM
Comments
PDSP_3720
Citation
 Gomeza, JMary, SBrabet, IParmentier, MLRestituito, SBockaert, JPin, JP Coupling of metabotropic glutamate receptors 2 and 4 to G alpha 15, G alpha 16, and chimeric G alpha q/i proteins: characterization of new antagonists. Mol Pharmacol 50:923-30 (1996) Target
Name:
Metabotropic glutamate receptor 4
Synonyms:
GRM4_RAT Grm4 Metabotropic glutamate receptor 4 (mGlu4) mGlu4 metabotropic glutamate 4a
Type:
Enzyme
Mol. Mass.:
101849.79
Organism:
Rattus norvegicus (Rat)
Description:
P31423
Residue:
912
  
Inhibitor
Name:
BDBM50004863
Synonyms:
(+/-)-trans-ACPD (1S,3S)-1-aminocyclopentane-1,3-dicarboxylic acid 1-Amino-cyclopentane-1,3-dicarboxylic acid(cis-(1S,3S)-ACPD) 1R,3S-ACPD CHEMBL29726
Type:
Small organic molecule
Emp. Form.:
C7H11NO4
Mol. Mass.:
173.1665
SMILES:
N[C@]1(CC[C@@H](C1)C(O)=O)C(O)=O
: