Target
Melanocortin receptor 4
Ligand
BDBM82414
Substrate
Ki
>10000±n/a nM
Comments
PDSP_2964
Citation
 Schiöth, HBMuceniece, RWikberg, JE Characterisation of the melanocortin 4 receptor by radioligand binding. Pharmacol Toxicol 79:161-5 (1996)  
Target
Name:
Melanocortin receptor 4
Synonyms:
MC4-R MC4R_HUMAN Melanocortin receptor 4 (MC-4) Melanocortin receptor 4 (MC4R)
Type:
Enzyme
Mol. Mass.:
36949.50
Organism:
Homo sapiens (Human)
Description:
P32245
Residue:
332
  
Inhibitor
Name:
BDBM82414
Synonyms:
delta MSH
Type:
Small organic molecule
Emp. Form.:
C37H57N11O11S
Mol. Mass.:
863.981
SMILES:
CSCC[C@H](NC(=O)[C@@H](N)CO)C(=O)N[C@@H](CCC(O)=O)C(=O)N[C@@H](C(C)C)C(=O)N[C@@H](CCCN=C(N)N)C(=O)NCC(=O)N[C@@H](Cc1c[nH]c2ccccc12)C(O)=O
: