Target
Melanocortin receptor 4
Ligand
BDBM82416
Substrate
Ki
>10000±n/a nM
Comments
PDSP_2959
Citation
 Schiöth, HBMuceniece, RWikberg, JE Characterisation of the melanocortin 4 receptor by radioligand binding. Pharmacol Toxicol 79:161-5 (1996)  
Target
Name:
Melanocortin receptor 4
Synonyms:
MC4-R MC4R_HUMAN Melanocortin receptor 4 (MC-4) Melanocortin receptor 4 (MC4R)
Type:
Enzyme
Mol. Mass.:
36949.50
Organism:
Homo sapiens (Human)
Description:
P32245
Residue:
332
  
Inhibitor
Name:
BDBM82416
Synonyms:
Gamma3-MSH
Type:
Small organic molecule
Emp. Form.:
C126H188N44O37S
Mol. Mass.:
2943.179
SMILES:
CSCC[C@H](NC(=O)[C@@H](NC(=O)[C@@H](N)Cc1ccc(O)cc1)C(C)C)C(=O)NCC(=O)N[C@@H](Cc1cnc[nH]1)C(=O)N[C@@H](Cc1ccccc1)C(=O)N[C@@H](CCCN=C(N)N)C(=O)N[C@@H](Cc1c[nH]c2ccccc12)C(=O)N[C@@H](CC(O)=O)C(=O)N[C@@H](CCCN=C(N)N)C(=O)N[C@@H](Cc1ccccc1)C(=O)NCC(=O)N[C@H](CCCN=C(N)N)C(=O)N[C@H](CCCN=C(N)N)C(=O)N[C@H](CC(N)=O)C(=O)NCC(=O)N[C@H](CO)C(=O)N[C@H](CO)C(=O)N[C@H](CO)C(=O)N[C@H](CO)C(=O)NCC(=O)N[C@H](C(C)C)C(=O)NCC(=O)NCC(=O)N[C@H](C)C(=O)N[C@H](C)C(=O)N[C@H](CCC(N)=O)C(O)=O
: