Target
Gamma-aminobutyric acid receptor subunit alpha-1
Ligand
BDBM21363
Substrate
Ki
26±n/a nM
Comments
PDSP_1236
Citation
 Hoogerkamp, AArends, RHBomers, AMMandema, JWVoskuyl, RADanhof, M Pharmacokinetic/pharmacodynamic relationship of benzodiazepines in the direct cortical stimulation model of anticonvulsant effect. J Pharmacol Exp Ther 279:803-12 (1996) Target
Name:
Gamma-aminobutyric acid receptor subunit alpha-1
Synonyms:
Benzodiazepine central GABA A Benzodiazepine GABA A Benzodiazepine Type II GABA A Benzodiazepine Type IIM GABA A Benzodiazepine omega2 GABA A alpha1 GABA receptor alpha-1 subunit GABA-PICROTOXIN Gabra-1 TBPS
Type:
Enzyme
Mol. Mass.:
51770.21
Organism:
Rattus norvegicus (Rat)
Description:
P62813
Residue:
455
  
Inhibitor
Name:
BDBM21363
Synonyms:
12-chloro-9-(2-fluorophenyl)-3-methyl-2,4,8-triazatricyclo[8.4.0.0^{2,6}]tetradeca-1(10),3,5,8,11,13-hexaene CHEMBL655 Midazolam US20230416258, Compound Midazolam
Type:
Small organic molecule
Emp. Form.:
C18H13ClFN3
Mol. Mass.:
325.767
SMILES:
Cc1ncc2CN=C(c3ccccc3F)c3cc(Cl)ccc3-n12
: