Target
5-hydroxytryptamine receptor 2A
Ligand
BDBM85034
Substrate
Ki
0.07±n/a nM
Comments
PDSP_455
Citation
 Schotte, AJanssen, PFGommeren, WLuyten, WHVan Gompel, PLesage, ASDe Loore, KLeysen, JE Risperidone compared with new and reference antipsychotic drugs: in vitro and in vivo receptor binding. Psychopharmacology (Berl) 124:57-73 (1996)  
Target
Name:
5-hydroxytryptamine receptor 2A
Synonyms:
5-HT-2 5-HT2A 5-hydroxytryptamine receptor 2A (5HT-2A) 5HT2A_HUMAN HTR2A | Serotonin receptor 2A
Type:
undefined
Mol. Mass.:
52607.65
Organism:
Homo sapiens (Human)
Description:
P28223
Residue:
471
  
Inhibitor
Name:
BDBM85034
Synonyms:
BW-501 BW501
Type:
Small organic molecule
Emp. Form.:
C17H20ClN3O
Mol. Mass.:
317.813
SMILES:
NC(CNc1ccccc1)=NCCCOc1ccccc1Cl
: