Target
Histamine H1 receptor
Ligand
BDBM82479
Substrate
Ki
3.5±n/a nM
Comments
PDSP_1408
Citation
 Schotte, AJanssen, PFGommeren, WLuyten, WHVan Gompel, PLesage, ASDe Loore, KLeysen, JE Risperidone compared with new and reference antipsychotic drugs: in vitro and in vivo receptor binding. Psychopharmacology (Berl) 124:57-73 (1996)  
Target
Name:
Histamine H1 receptor
Synonyms:
HISTAMINE H1 HRH1_CAVPO
Type:
G Protein-Coupled Receptor (GPCR)
Mol. Mass.:
55641.53
Organism:
Cavia porcellus (domestic guinea pig)
Description:
Guinea pig cerebellum was used in binding assay.
Residue:
488
  
Inhibitor
Name:
BDBM82479
Synonyms:
CAS_132539-06-1 OLANZAPINE | USRE49340, Rank 2
Type:
Small organic molecule
Emp. Form.:
C17H20N4S
Mol. Mass.:
312.432
SMILES:
CN1CCN(CC1)C1=c2cc(C)sc2=Nc2ccccc2N1
: