Target
Sodium channel protein type 10 subunit alpha
Ligand
BDBM22869
Substrate
Ki
4560±n/a nM
Comments
PDSP_552
Citation
 Schotte, AJanssen, PFGommeren, WLuyten, WHVan Gompel, PLesage, ASDe Loore, KLeysen, JE Risperidone compared with new and reference antipsychotic drugs: in vitro and in vivo receptor binding. Psychopharmacology (Berl) 124:57-73 (1996)  
Target
Name:
Sodium channel protein type 10 subunit alpha
Synonyms:
SCNAA_RAT Sns Sodium channel protein type X alpha subunit | Voltage-gated sodium channel subunit alpha Nav1.8
Type:
Enzyme
Mol. Mass.:
219724.17
Organism:
Rattus norvegicus (Rat)
Description:
Q62968
Residue:
1956
  
Inhibitor
Name:
BDBM22869
Synonyms:
6-chloro-10-(4-methylpiperazin-1-yl)-2,9-diazatricyclo[9.4.0.0^{3,8}]pentadeca-1,3(8),4,6,10,12,14-heptaene Clozapine US10259786, Clozapine
Type:
Small organic molecule
Emp. Form.:
C18H19ClN4
Mol. Mass.:
326.823
SMILES:
CN1CCN(CC1)C1=c2ccccc2=Nc2ccc(Cl)cc2N1
: