Target
D(2) dopamine receptor
Ligand
BDBM85046
Substrate
Ki
930±n/a nM
Comments
PDSP_2083
Citation
 Seeman, PGuan, HCNobrega, JJiwa, DMarkstein, RBalk, JHPicetti, RBorrelli, EVan Tol, HH Dopamine D2-like sites in schizophrenia, but not in Alzheimer's, Huntington's, or control brains, for [3H]benzquinoline. Synapse 25:137-46 (1997)  
Target
Name:
D(2) dopamine receptor
Synonyms:
DOPAMINE D2 DOPAMINE D2 Short Dopamine D2 receptor Drd2
Type:
G Protein-Coupled Receptor (GPCR)
Mol. Mass.:
50931.60
Organism:
Rattus norvegicus (rat)
Description:
P61169
Residue:
444
  
Inhibitor
Name:
BDBM85046
Synonyms:
Aminotetralin-6,7-dihydroxy-(-)
Type:
Small organic molecule
Emp. Form.:
C10H13NO2
Mol. Mass.:
179.2157
SMILES:
N[C@H]1CCc2cc(O)c(O)cc2C1
: