Target
D(2) dopamine receptor
Ligand
BDBM81775
Substrate
Ki
4634±n/a nM
Comments
PDSP_1784
Citation
 Seeman, PGuan, HCNobrega, JJiwa, DMarkstein, RBalk, JHPicetti, RBorrelli, EVan Tol, HH Dopamine D2-like sites in schizophrenia, but not in Alzheimer's, Huntington's, or control brains, for [3H]benzquinoline. Synapse 25:137-46 (1997)  
Target
Name:
D(2) dopamine receptor
Synonyms:
D(2) dopamine receptor DOPAMINE D2 Long DRD2 Dopamine D2 receptor Dopamine D2 receptor (D2R) Dopamine2-like | d2
Type:
Cell-surface receptors
Mol. Mass.:
50647.10
Organism:
Homo sapiens (Human)
Description:
P14416
Residue:
443
  
Inhibitor
Name:
BDBM81775
Synonyms:
Sulpiride-R Sulpiride-high,(-) | Sulpiride-low,(-)
Type:
Emp. Form.:
C15H23N3O4S
Mol. Mass.:
341.426
SMILES:
CCN1CCC[C@@H]1CNC(=O)c1cc(ccc1OC)S(N)(=O)=O
: