Target
D(2) dopamine receptor
Ligand
BDBM81775
Substrate
Ki
1063±n/a nM
Comments
PDSP_1784
Citation
 Seeman, PGuan, HCNobrega, JJiwa, DMarkstein, RBalk, JHPicetti, RBorrelli, EVan Tol, HH Dopamine D2-like sites in schizophrenia, but not in Alzheimer's, Huntington's, or control brains, for [3H]benzquinoline. Synapse 25:137-46 (1997)  
Target
Name:
D(2) dopamine receptor
Synonyms:
DOPAMINE D2 Dopamine D2 receptor Drd2
Type:
Enzyme
Mol. Mass.:
50957.64
Organism:
Mus musculus (Mouse)
Description:
P61168
Residue:
444
  
Inhibitor
Name:
BDBM81775
Synonyms:
Sulpiride-R Sulpiride-high,(-) | Sulpiride-low,(-)
Type:
Emp. Form.:
C15H23N3O4S
Mol. Mass.:
341.426
SMILES:
CCN1CCC[C@@H]1CNC(=O)c1cc(ccc1OC)S(N)(=O)=O
: