Target
Somatostatin receptor type 3
Ligand
BDBM82256
Substrate
Ki
177±n/a nM
Comments
PDSP_385
Citation
 Shimon, ITaylor, JEDong, JZBitonte, RAKim, SMorgan, BCoy, DHCuller, MDMelmed, S Somatostatin receptor subtype specificity in human fetal pituitary cultures. Differential role of SSTR2 and SSTR5 for growth hormone, thyroid-stimulating hormone, and prolactin regulation. J Clin Invest 99:789-98 (1997)  
Target
Name:
Somatostatin receptor type 3
Synonyms:
SOMATOSTATIN SST3 SS3-R SSR-28 SSTR3 | Somatostatin receptor type 3 (SSTR3)
Type:
Protein
Mol. Mass.:
45855.97
Organism:
Homo sapiens (Human)
Description:
P32745
Residue:
418
  
Inhibitor
Name:
BDBM82256
Synonyms:
BIM 23056 D-Phe-Phe-Tyr-D-Trp-Lys-Val-Phe-D-Nal-NH2 | DC-25-20
Type:
Small organic molecule
Emp. Form.:
C71H81N11O9
Mol. Mass.:
1232.4711
SMILES:
CC(C)[C@H](NC(=O)[C@H](CCCCN)NC(=O)[C@@H](Cc1c[nH]c2ccccc12)NC(=O)[C@H](Cc1ccc(O)cc1)NC(=O)[C@H](Cc1ccccc1)NC(=O)[C@H](N)Cc1ccccc1)C(=O)N[C@@H](Cc1ccccc1)C(=O)N[C@H](Cc1ccc2ccccc2c1)C(N)=O
: