Target
Cannabinoid receptor 1
Ligand
BDBM21278
Substrate
Ki
37.5±n/a nM
Comments
PDSP_3415
Citation
 Stefano, GBSalzet, BSalzet, M Identification and characterization of the leech CNS cannabinoid receptor: coupling to nitric oxide release. Brain Res 753:219-24 (1997)  
Target
Name:
Cannabinoid receptor 1
Synonyms:
CANNABINOID CB1 | CNR1
Type:
Enzyme Catalytic Domain
Mol. Mass.:
44900.17
Organism:
Hirudo medicinalis
Description:
CANNABINOID CB1 CNR1 Hirudo medicinalis::A0A0H4AWC7
Residue:
396
  
Inhibitor
Name:
BDBM21278
Synonyms:
5-(4-chlorophenyl)-1-(2,4-dichlorophenyl)-4-methyl-N-(piperidin-1-yl)-1H-pyrazole-3-carboxamide CHEMBL111 RIMONABANT HYDROCHLORIDE SR 141716A SR141716A [3H]SR141716A
Type:
Small organic molecule
Emp. Form.:
C22H21Cl3N4O
Mol. Mass.:
463.787
SMILES:
Cc1c(nn(c1-c1ccc(Cl)cc1)-c1ccc(Cl)cc1Cl)C(=O)NN1CCCCC1
: