Target
5-hydroxytryptamine receptor 1D
Ligand
BDBM82472
Substrate
Ki
630.96±n/a nM
Comments
PDSP_456
Citation
 Kennett, GAAinsworth, KTrail, BBlackburn, TP BW 723C86, a 5-HT2B receptor agonist, causes hyperphagia and reduced grooming in rats. Neuropharmacology 36:233-9 (1997)  
Target
Name:
5-hydroxytryptamine receptor 1D
Synonyms:
5-HT-1D 5-HT1D 5HT1D_HUMAN HTR1DA Serotonin (5-HT) receptor | Serotonin Receptor 1D
Type:
G Protein-Coupled Receptor (GPCR)
Mol. Mass.:
41920.63
Organism:
Homo sapiens (Human)
Description:
Receptor binding assays were performed using human clone stably expressed in CHO cells.
Residue:
377
  
Inhibitor
Name:
BDBM82472
Synonyms:
BW-723C86 NSC_5311036
Type:
Small organic molecule
Emp. Form.:
C16H18N2OS
Mol. Mass.:
286.392
SMILES:
CC(N)Cc1c[nH]c2ccc(OCc3cccs3)cc12
: