Target
5-hydroxytryptamine receptor 1D
Ligand
BDBM50073682
Substrate
Ki
1.5±n/a nM
Comments
PDSP_1291
Citation
 Doménech, TBeleta, JPalacios, JM Characterization of human serotonin 1D and 1B receptors using [3H]-GR-125743, a novel radiolabelled serotonin 5HT1D/1B receptor antagonist. Naunyn Schmiedebergs Arch Pharmacol 356:328-34 (1997)  
Target
Name:
5-hydroxytryptamine receptor 1D
Synonyms:
5-HT-1D 5-HT1D 5HT1D_HUMAN HTR1DA Serotonin (5-HT) receptor | Serotonin Receptor 1D
Type:
G Protein-Coupled Receptor (GPCR)
Mol. Mass.:
41920.63
Organism:
Homo sapiens (Human)
Description:
Receptor binding assays were performed using human clone stably expressed in CHO cells.
Residue:
377
  
Inhibitor
Name:
BDBM50073682
Synonyms:
CHEMBL1278 N-methyl-2-[3-(1-methyl-4-piperidyl)-1H-indol-5-yl]-ethanesulfonamide NARATRIPTAN
Type:
Small organic molecule
Emp. Form.:
C17H25N3O2S
Mol. Mass.:
335.464
SMILES:
CNS(=O)(=O)CCc1ccc2[nH]cc(C3CCN(C)CC3)c2c1
: