Target
Sodium-dependent serotonin transporter
Ligand
BDBM50028091
Substrate
Ki
1.5±n/a nM
Comments
PDSP_844
Citation
 Owens, MJMorgan, WNPlott, SJNemeroff, CB Neurotransmitter receptor and transporter binding profile of antidepressants and their metabolites. J Pharmacol Exp Ther 283:1305-22 (1997) Target
Name:
Sodium-dependent serotonin transporter
Synonyms:
5-HT Transporter 5HT transporter Anandamid membrane transporter, AMT Monoamine transporters; Norepinephrine & serotonin Slc6a4 Sodium-dependent serotonin transporter (SERT) | imipramine receptor
Type:
Multi-pass membrane protein
Mol. Mass.:
70168.43
Organism:
Rattus norvegicus (rat)
Description:
P31652
Residue:
630
  
Inhibitor
Name:
BDBM50028091
Synonyms:
(1E)-5-methoxy-1-[4-(trifluoromethyl)phenyl]pentan-1-one O-(2-aminoethyl)oxime FLUVOXAMINE
Type:
Small organic molecule
Emp. Form.:
C15H21F3N2O2
Mol. Mass.:
318.3346
SMILES:
COCCCC\C(=N/OCCN)c1ccc(cc1)C(F)(F)F
: