Target
Alpha-1A adrenergic receptor
Ligand
BDBM85198
Substrate
Ki
8±n/a nM
Comments
PDSP_942
Citation
 Owens, MJMorgan, WNPlott, SJNemeroff, CB Neurotransmitter receptor and transporter binding profile of antidepressants and their metabolites. J Pharmacol Exp Ther 283:1305-22 (1997) Target
Name:
Alpha-1A adrenergic receptor
Synonyms:
ADA1A_HUMAN ADRA1C Alpha 1A-adrenoceptor Alpha adrenergic receptor 1a Alpha-adrenergic receptor 1c adrenergic Alpha1 | adrenergic Alpha1C
Type:
Cell-surface receptors
Mol. Mass.:
51511.67
Organism:
Homo sapiens (Human)
Description:
P35348
Residue:
466
  
Inhibitor
Name:
BDBM85198
Synonyms:
CAS_127096 NSC_127096
Type:
Small organic molecule
Emp. Form.:
C25H32ClN5O3
Mol. Mass.:
486.006
SMILES:
CC(O)c1nn(CCCN2CCN(CC2)c2ccc(Cl)cc2)c(=O)n1CCOc1ccccc1
: