Target
D(1A) dopamine receptor
Ligand
BDBM50095890
Substrate
Ki
390±n/a nM
Comments
PDSP_1571
Citation
 Arnt, JSkarsfeldt, T Do novel antipsychotics have similar pharmacological characteristics? A review of the evidence. Neuropsychopharmacology 18:63-101 (1998)  
Target
Name:
D(1A) dopamine receptor
Synonyms:
DOPAMINE D1 Dopamine D1 high Dopamine receptor Dopamine1-like Drd1a
Type:
Enzyme Catalytic Domain
Mol. Mass.:
49429.75
Organism:
RAT
Description:
P18901
Residue:
446
  
Inhibitor
Name:
BDBM50095890
Synonyms:
2-[2-(4-Dibenzo[b,f][1,4]thiazepin-11-yl-1-piperazinyl)ethoxy]ethanol CHEMBL716 | QUETIAPINE
Type:
Small organic molecule
Emp. Form.:
C21H25N3O2S
Mol. Mass.:
383.507
SMILES:
OCCOCCN1CCN(CC1)C1=Nc2ccccc2Sc2ccccc12
: