Target
Neuronal acetylcholine receptor subunit alpha-4
Ligand
BDBM50061567
Substrate
Ki
>10000±n/a nM
Comments
PDSP_691
Citation
 Stauderman, KAMahaffy, LSAkong, MVeliçelebi, GChavez-Noriega, LECrona, JHJohnson, ECElliott, KJGillespie, AReid, RTAdams, PHarpold, MMCorey-Naeve, J Characterization of human recombinant neuronal nicotinic acetylcholine receptor subunit combinations alpha2beta4, alpha3beta4 and alpha4beta4 stably expressed in HEK293 cells. J Pharmacol Exp Ther 284:777-89 (1998) Target
Name:
Neuronal acetylcholine receptor subunit alpha-4
Synonyms:
ACHA4_HUMAN CHRNA4 protein Neuronal acetylcholine receptor protein alpha-4 subunit Nicotinic acetylcholine receptor alpha4/beta2/alpha5
Type:
Mol. Mass.:
69963.49
Organism:
Homo sapiens (Human)
Description:
NACHRA4
Residue:
627
  
Inhibitor
Name:
BDBM50061567
Synonyms:
1,1-Dimethyl-4-phenyl-piperazin-1-ium CHEMBL47814 cid_5911
Type:
Small organic molecule
Emp. Form.:
C12H19N2
Mol. Mass.:
191.2921
SMILES:
C[N+]1(C)CCN(CC1)c1ccccc1
: