Target
Glutamate receptor 3
Ligand
BDBM82560
Substrate
Ki
501±n/a nM
Comments
PDSP_704
Citation
 Varney, MARao, SPJachec, CDeal, CHess, SDDaggett, LPLin, FJohnson, ECVeliçelebi, G Pharmacological characterization of the human ionotropic glutamate receptor subtype GluR3 stably expressed in mammalian cells. J Pharmacol Exp Ther 285:358-70 (1998) Target
Name:
Glutamate receptor 3
Synonyms:
GRIA3_RAT Glutamate receptor 3 Glutamate-AMPA | Gria3
Type:
Enzyme Catalytic Domain
Mol. Mass.:
100383.57
Organism:
RAT
Description:
Glutamate-AMPA GRIA3 RAT::P19492
Residue:
888
  
Inhibitor
Name:
BDBM82560
Synonyms:
CAS_2379-57-9 NSC_3140
Type:
Small organic molecule
Emp. Form.:
C8H2N4O6
Mol. Mass.:
250.1247
SMILES:
[O-][N+](=O)c1cc2=NC(=O)C(=O)N=c2cc1[N+]([O-])=O
: