Target
Sodium-dependent serotonin transporter
Ligand
BDBM50115644
Substrate
Ki
>10000±n/a nM
Comments
PDSP_3343
Citation
 Tatsumi, MGroshan, KBlakely, RDRichelson, E Pharmacological profile of antidepressants and related compounds at human monoamine transporters. Eur J Pharmacol 340:249-58 (1997)  
Target
Name:
Sodium-dependent serotonin transporter
Synonyms:
5-HT Transporter 5HTT SC6A4_HUMAN SLC6A4 Serotonin transporter (5HTT) Sodium-dependent serotonin transporter (SERT) | Solute carrier family 6 member 4
Type:
Multi-pass membrane protein
Mol. Mass.:
70322.51
Organism:
Homo sapiens (Human)
Description:
P31645
Residue:
630
  
Inhibitor
Name:
BDBM50115644
Synonyms:
(+/-)-12-Methyl-1,2,3,4,9,13b-hexahydro-2,4a,5-triaza-tribenzo[a,c,e]cycloheptene CHEMBL654 ORG 3770 | REMERON
Type:
Small organic molecule
Emp. Form.:
C17H19N3
Mol. Mass.:
265.3529
SMILES:
CN1CCN2C(C1)c1ccccc1Cc1cccnc21
: