Target
Somatostatin receptor type 3
Ligand
BDBM81767
Substrate
Ki
1.33±n/a nM
Comments
PDSP_1735
Citation
 Meyerhof, W The elucidation of somatostatin receptor functions: a current view. Rev Physiol Biochem Pharmacol 133:55-108 (1998)  
Target
Name:
Somatostatin receptor type 3
Synonyms:
SOMATOSTATIN SST3 Somatostatin receptor Somatostatin receptor type 3 | Sstr3
Type:
Enzyme Catalytic Domain
Mol. Mass.:
47161.54
Organism:
RAT
Description:
SOMATOSTATIN SST3 SSTR3 RAT::P30936
Residue:
428
  
Inhibitor
Name:
BDBM81767
Synonyms:
15-28-Somatostatin-28 CB6417646 | Somatostatin-14
Type:
Small organic molecule
Emp. Form.:
C76H104N18O19S2
Mol. Mass.:
1637.878
SMILES:
C[C@@H](O)[C@@H]1NC(=O)[C@H](Cc2ccccc2)NC(=O)[C@@H](NC(=O)[C@H](CCCCN)NC(=O)[C@H](Cc2c[nH]c3ccccc23)NC(=O)[C@H](Cc2ccccc2)NC(=O)[C@H](Cc2ccccc2)NC(=O)[C@H](CC(N)=O)NC(=O)[C@H](CCCCN)NC(=O)[C@H](CSSC[C@H](NC(=O)[C@H](CO)NC1=O)C(O)=O)NC(=O)CNC(=O)[C@H](C)N)[C@@H](C)O
: