Target
Somatostatin receptor type 5
Ligand
BDBM82470
Substrate
Ki
23±n/a nM
Comments
PDSP_373
Citation
 Meyerhof, W The elucidation of somatostatin receptor functions: a current view. Rev Physiol Biochem Pharmacol 133:55-108 (1998)  
Target
Name:
Somatostatin receptor type 5
Synonyms:
SOMATOSTATIN SST5 Somatostatin receptor Sstr5
Type:
Enzyme Catalytic Domain
Mol. Mass.:
39986.50
Organism:
RAT
Description:
SOMATOSTATIN SST5 SSTR5 RAT::P30938
Residue:
363
  
Inhibitor
Name:
BDBM82470
Synonyms:
3-(2-Naphtyl)-D-Ala-L-Cys(1)-L-Tyr-D-Trp-L-Lys-L-Val-L-Cys(1)-L-Thr-NH2 BIM-23014 | LANREOTIDE
Type:
Small organic molecule
Emp. Form.:
C54H69N11O10S2
Mol. Mass.:
1096.323
SMILES:
CC(C)[C@@H]1NC(=O)[C@H](CCCCN)NC(=O)[C@@H](Cc2c[nH]c3ccccc23)NC(=O)[C@H](Cc2ccc(O)cc2)NC(=O)[C@H](CSSC[C@H](NC1=O)C(=O)N[C@@H]([C@@H](C)O)C(N)=O)NC(=O)[C@H](N)Cc1ccc2ccccc2c1
: