Target
Somatostatin receptor type 5
Ligand
BDBM50063839
Substrate
Ki
2.18±n/a nM
Comments
PDSP_3365
Citation
 Meyerhof, W The elucidation of somatostatin receptor functions: a current view. Rev Physiol Biochem Pharmacol 133:55-108 (1998)  
Target
Name:
Somatostatin receptor type 5
Synonyms:
SOMATOSTATIN SST5 SS5-R SSR5_HUMAN Somatostatin receptor type 5 (SSTR5)
Type:
Enzyme
Mol. Mass.:
39218.02
Organism:
Homo sapiens (Human)
Description:
P35346
Residue:
364
  
Inhibitor
Name:
BDBM50063839
Synonyms:
BIM 23268 H-cyclo[DCys-Phe-Phe-DTrp-Lys-Thr-Phe-DCys]-NH2
Type:
Small organic molecule
Emp. Form.:
C54H67N11O9S2
Mol. Mass.:
1078.308
SMILES:
CC(O)[C@H]1NC(=O)[C@H](CCCCN)NC(=O)[C@H](Cc2c[nH]c3ccccc23)NC(=O)[C@H](Cc2ccccc2)NC(=O)[C@@H](Cc2ccccc2)NC(=O)[C@H](N)CSSC[C@@H](NC(=O)[C@H](Cc2ccccc2)NC1=O)C(N)=O
: