Target
Somatostatin receptor type 3
Ligand
BDBM85357
Substrate
Ki
31±n/a nM
Comments
PDSP_7578
Citation
 Yang, LBerk, SCRohrer, SPMosley, RTGuo, LUnderwood, DJArison, BHBirzin, ETHayes, ECMitra, SWParmar, RMCheng, KWu, TJButler, BSFoor, FPasternak, APan, YSilva, MFreidinger, RMSmith, RGChapman, KSchaeffer, JMPatchett, AA Synthesis and biological activities of potent peptidomimetics selective for somatostatin receptor subtype 2. Proc Natl Acad Sci U S A 95:10836-41 (1998)  
Target
Name:
Somatostatin receptor type 3
Synonyms:
SOMATOSTATIN SST3 SS3-R SSR-28 SSTR3 | Somatostatin receptor type 3 (SSTR3)
Type:
Protein
Mol. Mass.:
45855.97
Organism:
Homo sapiens (Human)
Description:
P32745
Residue:
418
  
Inhibitor
Name:
BDBM85357
Synonyms:
2-[[(2R,3S)-2-[[4-[(2-Oxo-2,3-dihydro-1H-benzimidazole)-1-yl]piperidino]carbonylamino]-3-(1H-indole-3-yl)butyryl]amino]-6-aminohexanoic acid tert-butyl ester L-054522
Type:
Small organic molecule
Emp. Form.:
C35H47N7O5
Mol. Mass.:
645.7916
SMILES:
C[C@H]([C@@H](NC(=O)N1CCC(CC1)n1c2ccccc2[nH]c1=O)C(=O)NC(CCCCN)C(=O)OC(C)(C)C)c1c[nH]c2ccccc12
: