Target
5-hydroxytryptamine receptor 2A
Ligand
BDBM50014997
Substrate
Ki
0.1±n/a nM
Comments
PDSP_718
Citation
 Nelson, DLLucaites, VLWainscott, DBGlennon, RA Comparisons of hallucinogenic phenylisopropylamine binding affinities at cloned human 5-HT2A, -HT(2B) and 5-HT2C receptors. Naunyn Schmiedebergs Arch Pharmacol 359:1-6 (1999)  
Target
Name:
5-hydroxytryptamine receptor 2A
Synonyms:
5-HT-2 5-HT2A 5-hydroxytryptamine receptor 2A (5HT-2A) 5HT2A_HUMAN HTR2A | Serotonin receptor 2A
Type:
undefined
Mol. Mass.:
52607.65
Organism:
Homo sapiens (Human)
Description:
P28223
Residue:
471
  
Inhibitor
Name:
BDBM50014997
Synonyms:
1-(4-hexyl-2,5-dimethoxyphenyl)propan-2-amine CHEMBL268890 | DOHx
Type:
Small organic molecule
Emp. Form.:
C17H29NO2
Mol. Mass.:
279.4177
SMILES:
CCCCCCc1cc(OC)c(CC(C)N)cc1OC
: