Target
Norepinephrine transporter
Ligand
BDBM50028091
Substrate
Ki
620±n/a nM
Comments
PDSP_844
Citation
 Sánchez, CHyttel, J Comparison of the effects of antidepressants and their metabolites on reuptake of biogenic amines and on receptor binding. Cell Mol Neurobiol 19:467-89 (1999)  
Target
Name:
Norepinephrine transporter
Synonyms:
Type:
Enzyme Catalytic Domain
Mol. Mass.:
2082.45
Organism:
RAT
Description:
Norepinephrine transporter 0 RAT::Q9JIA2
Residue:
19
MLLARMKPQVQPELGGADQ
  
Inhibitor
Name:
BDBM50028091
Synonyms:
(1E)-5-methoxy-1-[4-(trifluoromethyl)phenyl]pentan-1-one O-(2-aminoethyl)oxime FLUVOXAMINE
Type:
Small organic molecule
Emp. Form.:
C15H21F3N2O2
Mol. Mass.:
318.3346
SMILES:
COCCCC\C(=N/OCCN)c1ccc(cc1)C(F)(F)F
: