Target
5-hydroxytryptamine receptor 2A
Ligand
BDBM50056445
Substrate
Ki
6918.31±n/a nM
Comments
PDSP_1080
Citation
 Porter, RHBenwell, KRLamb, HMalcolm, CSAllen, NHRevell, DFAdams, DRSheardown, MJ Functional characterization of agonists at recombinant human 5-HT2A, 5-HT2B and 5-HT2C receptors in CHO-K1 cells. Br J Pharmacol 128:13-20 (1999)  
Target
Name:
5-hydroxytryptamine receptor 2A
Synonyms:
5-HT-2 5-HT2A 5-hydroxytryptamine receptor 2A (5HT-2A) 5HT2A_HUMAN HTR2A | Serotonin receptor 2A
Type:
undefined
Mol. Mass.:
52607.65
Organism:
Homo sapiens (Human)
Description:
P28223
Residue:
471
  
Inhibitor
Name:
BDBM50056445
Synonyms:
1,1-diethyl-3-[(8alpha)-6-methyl-9,10-didehydroergolin-8-yl]urea N'-((8alpha)-9,10-Didehydro-6-methylergolin-8-yl)-N,N-diethylurea lisuride, (S)
Type:
Small organic molecule
Emp. Form.:
C20H26N4O
Mol. Mass.:
338.4466
SMILES:
CCN(CC)C(=O)N[C@@H]1CN(C)[C@@H]2Cc3c[nH]c4cccc(C2=C1)c34
: