Target
5-hydroxytryptamine receptor 2C
Ligand
BDBM81781
Substrate
Ki
11.48±n/a nM
Comments
PDSP_155
Citation
 Porter, RHBenwell, KRLamb, HMalcolm, CSAllen, NHRevell, DFAdams, DRSheardown, MJ Functional characterization of agonists at recombinant human 5-HT2A, 5-HT2B and 5-HT2C receptors in CHO-K1 cells. Br J Pharmacol 128:13-20 (1999)  
Target
Name:
5-hydroxytryptamine receptor 2C
Synonyms:
5-HT-2C 5-HT2C-INI 5-HTR2C 5-hydroxytryptamine receptor 2C (5-HT-2C) 5HT-1C HTR1C Serotonin (5-HT3) receptor Serotonin Receptor 2C
Type:
G Protein-Coupled Receptor (GPCR)
Mol. Mass.:
51836.79
Organism:
Homo sapiens (Human)
Description:
P28335
Residue:
458
  
Inhibitor
Name:
BDBM81781
Synonyms:
5-HT,a-Me | 5-HT,omega-N-Me
Type:
Emp. Form.:
C11H14N2O
Mol. Mass.:
190.2417
SMILES:
Cn1cc(CCN)c2cc(O)ccc12
: