Target
5-hydroxytryptamine receptor 2C
Ligand
BDBM81498
Substrate
Ki
281.84±n/a nM
Comments
PDSP_1643
Citation
 Porter, RHBenwell, KRLamb, HMalcolm, CSAllen, NHRevell, DFAdams, DRSheardown, MJ Functional characterization of agonists at recombinant human 5-HT2A, 5-HT2B and 5-HT2C receptors in CHO-K1 cells. Br J Pharmacol 128:13-20 (1999)  
Target
Name:
5-hydroxytryptamine receptor 2C
Synonyms:
5-HT-2C 5-HT2C-INI 5-HTR2C 5-hydroxytryptamine receptor 2C (5-HT-2C) 5HT-1C HTR1C Serotonin (5-HT3) receptor Serotonin Receptor 2C
Type:
G Protein-Coupled Receptor (GPCR)
Mol. Mass.:
51836.79
Organism:
Homo sapiens (Human)
Description:
P28335
Residue:
458
  
Inhibitor
Name:
BDBM81498
Synonyms:
5-Methoxy-3-(1,2,3,6-tetrahydro-pyridin-4-yl)-1H-indole(RU-24969) CHEMBL18785 RU 24969
Type:
Small organic molecule
Emp. Form.:
C14H16N2O
Mol. Mass.:
228.2896
SMILES:
COc1ccc2[nH]cc(C3=CCNCC3)c2c1
: