Target
Delta-type opioid receptor
Ligand
BDBM85538
Substrate
Ki
1.78±n/a nM
Comments
PDSP_433
Citation
 Traynor, JRGuo, LCoop, ALewis, JWWoods, JH Ring-constrained orvinols as analogs of buprenorphine: differences in opioid activity related to configuration of C(20) hydroxyl group. J Pharmacol Exp Ther 291:1093-9 (1999) Target
Name:
Delta-type opioid receptor
Synonyms:
DOR-1 MSL-2 OPRD_MOUSE Oprd1
Type:
Enzyme Catalytic Domain
Mol. Mass.:
40577.25
Organism:
MOUSE
Description:
P32300
Residue:
372
  
Inhibitor
Name:
BDBM85538
Synonyms:
BU 61 | BU-61
Type:
Small organic molecule
Emp. Form.:
C27H33NO4
Mol. Mass.:
435.5552
SMILES:
COC12C=C[C@]3(C4C1CC[C@]4(C)O)[C@H]1Cc4ccc(O)c5O[C@@H]2[C@]3(CCN1CC1CC1)c45
: