Target
Kappa-type opioid receptor
Ligand
BDBM85540
Substrate
Ki
2.99±n/a nM
Comments
PDSP_435
Citation
 Traynor, JRGuo, LCoop, ALewis, JWWoods, JH Ring-constrained orvinols as analogs of buprenorphine: differences in opioid activity related to configuration of C(20) hydroxyl group. J Pharmacol Exp Ther 291:1093-9 (1999) Target
Name:
Kappa-type opioid receptor
Synonyms:
KOR-1 OPIATE Kappa Oprk1
Type:
Enzyme
Mol. Mass.:
42656.78
Organism:
Mus musculus (Mouse)
Description:
P33534
Residue:
380
  
Inhibitor
Name:
BDBM85540
Synonyms:
BU 96 | BU-96
Type:
Small organic molecule
Emp. Form.:
C28H35NO4
Mol. Mass.:
449.5818
SMILES:
COC12C=C[C@]3(C4[C@H](O)C(C)(C)CC14)[C@H]1Cc4ccc(O)c5O[C@@H]2[C@]3(CCN1CC1CC1)c45
: