Target
Carbonic anhydrase 2
Ligand
BDBM10880
Substrate
Meas. Tech.
Inhibition Assay
pH
7.4±0
Temperature
298.15±0 K
Ki
12±0.0 nM
Citation
 Scozzafava, ASaramet, IBanciu, MDSupuran, CT Carbonic anhydrase activity modulators: synthesis of inhibitors and activators incorporating 2-substituted-thiazol-4-yl-methyl scaffolds. J Enzym Inhib 16:351-8 (2001) Target
Name:
Carbonic anhydrase 2
Synonyms:
CA-II CAC Carbonate dehydratase II Carbonic anhydrase 2 (CA-II) Carbonic anhydrase C Carbonic anhydrase II (CA-II) Carbonic anhydrase II (hCA II) | Carbonic anhydrase isoenzyme II (hCA II)
Type:
Enzyme
Mol. Mass.:
29250.71
Organism:
Homo sapiens (Human)
Description:
P00918
Residue:
260
  
Inhibitor
Name:
BDBM10880
Synonyms:
AZA AZM acetazolamide Acetazolamide Acetazolamide (AZA) Acetazolamide, 5 Acetazolamide, AZA CHEMBL20 Sulfonamide, 1 US11278534, Example acetazolamide sulfonamide 1
Type:
Small organic molecule
Emp. Form.:
C4H6N4O3S2
Mol. Mass.:
222.245
SMILES:
CC(=O)Nc1nnc(s1)S(N)(=O)=O
: