Target
Leukotriene B4 receptor 1
Ligand
BDBM85696
Substrate
Ki
0.54±n/a nM
Comments
PDSP_1106
Citation
 Wang, SGustafson, EPang, LQiao, XBehan, JMaguire, MBayne, MLaz, T A novel hepatointestinal leukotriene B4 receptor. Cloning and functional characterization. J Biol Chem 275:40686-94 (2000)  
Target
Name:
Leukotriene B4 receptor 1
Synonyms:
BLT BLTR Chemoattractant receptor-like 1 GPR16 LTB4-R 1 Leukotriene B4 R1 Leukotriene B4 receptor 1 P2Y purinoceptor 7 | P2Y7
Type:
Enzyme Catalytic Domain
Mol. Mass.:
37582.68
Organism:
Homo sapiens (Human)
Description:
Q15722
Residue:
352
  
Inhibitor
Name:
BDBM85696
Synonyms:
LTB4-20-hydroxy
Type:
Small organic molecule
Emp. Form.:
C20H32O5
Mol. Mass.:
352.4651
SMILES:
OCCCCC\C=C/C[C@@H](O)\C=C\C=C\C=C/[C@@H](O)CCCC(O)=O
: