Target
Metabotropic glutamate receptor 1
Ligand
BDBM50053589
Substrate
Ki
>10000±n/a nM
Comments
PDSP_3334
Citation
 Mutel, VEllis, GJAdam, GChaboz, SNilly, AMesser, JBleuel, ZMetzler, VMalherbe, PSchlaeger, EJRoughley, BSFaull, RLRichards, JG Characterization of [(3)H]Quisqualate binding to recombinant rat metabotropic glutamate 1a and 5a receptors and to rat and human brain sections. J Neurochem 75:2590-601 (2000)  
Target
Name:
Metabotropic glutamate receptor 1
Synonyms:
GPRC1A GRM1_HUMAN Metabotropic Glutamate 1a | metabotropic glutamate 1
Type:
Enzyme
Mol. Mass.:
132358.19
Organism:
Homo sapiens (Human)
Description:
Q13255
Residue:
1194
  
Inhibitor
Name:
BDBM50053589
Synonyms:
(S)-3-Hydroxyphenylglycine 3HPG | CHEMBL442347
Type:
Small organic molecule
Emp. Form.:
C8H9NO3
Mol. Mass.:
167.162
SMILES:
N[C@H](C(O)=O)c1cccc(O)c1
: