Target
5-hydroxytryptamine receptor 2B
Ligand
BDBM84738
Substrate
Ki
5099±n/a nM
Comments
PDSP_815
Citation
 Rothman, RBBaumann, MHSavage, JERauser, LMcBride, AHufeisen, SJRoth, BL Evidence for possible involvement of 5-HT(2B) receptors in the cardiac valvulopathy associated with fenfluramine and other serotonergic medications. Circulation 102:2836-41 (2000)  
Target
Name:
5-hydroxytryptamine receptor 2B
Synonyms:
5-HT-2B 5-hydroxytryptamine (serotonin) receptor 2B [Homo sapiens] 5-hydroxytryptamine receptor 2C (5HT2C) HTR2B Serotonin 2b (5-HT2b) receptor | Serotonin Receptor 2B
Type:
G Protein-Coupled Receptor (GPCR)
Mol. Mass.:
54312.47
Organism:
Homo sapiens (Human)
Description:
Receptor binding assays were performed using human clone stably expressed in CHO cells.
Residue:
481
  
Inhibitor
Name:
BDBM84738
Synonyms:
CAS_16105-77-4 Fenfluramine (+) NSC_3337 | d-Fenfluramine
Type:
Small organic molecule
Emp. Form.:
C12H16F3N
Mol. Mass.:
231.2573
SMILES:
CCNC(C)Cc1cccc(c1)C(F)(F)F
: