Target
Proto-oncogene tyrosine-protein kinase Src
Ligand
BDBM3436
Substrate
Poly(E:Y)
Meas. Tech.
Kinase Inhibition Assay
IC50
1600±n/a nM
Citation
 Schroeder, MCHamby, JMConnolly, CJGrohar, PJWinters, RTBarvian, MRMoore, CWBoushelle, SLCrean, SMKraker, AJDriscoll, DLVincent, PWElliott, WLLu, GHBatley, BLDahring, TKMajor, TCPanek, RLDoherty, AMShowalter, HD Soluble 2-substituted aminopyrido[2,3-d]pyrimidin-7-yl ureas. Structure-activity relationships against selected tyrosine kinases and exploration of in vitro and in vivo anticancer activity. J Med Chem 44:1915-26 (2001)  
Target
Name:
Proto-oncogene tyrosine-protein kinase Src
Synonyms:
Calmodulin/Proto-oncogene tyrosine-protein kinase Src Proto-oncogene c-Src SRC SRC_HUMAN V-src sarcoma (Schmidt-Ruppin A-2) viral oncogene homolog (avian) p60-Src | pp60c-src
Type:
Protein
Mol. Mass.:
59838.60
Organism:
Homo sapiens (Human)
Description:
P12931
Residue:
536
  
Inhibitor
Name:
BDBM3436
Synonyms:
6-(2,6-Dibromo-phenyl)-pyrido[2,3-d]pyrimidine-2,7-diamine 6-arylpyrido[2,3-d]pyrimidine deriv. 18 | ACS Chem. Biol. Compound 1
Type:
Small organic molecule
Emp. Form.:
C13H9Br2N5
Mol. Mass.:
395.052
SMILES:
Nc1ncc2cc(c(N)nc2n1)-c1c(Br)cccc1Br
:
Substrate
Name:
Poly(E:Y)
Synonyms:
Type:
Random polymer
Mol. Mass.:
358.43
Organism:
Description:
Random copolymer of glutamic acid and tyrosine (4:1). 50 uM ATP containing 0.4 uCi of [gamma-32P]ATP as co-substrate
Residue:
3
NA