Target
Adenosine receptor A3
Ligand
BDBM82032
Substrate
Ki
53.32±n/a nM
Comments
PDSP_2052
Citation
 Durand, IHGreen, RD Cloning of a chick A3 adenosine receptor: characterization of ligand binding and receptor-effector coupling of chick A1 and A3 adenosine receptors. Naunyn Schmiedebergs Arch Pharmacol 363:81-6 (2001)  
Target
Name:
Adenosine receptor A3
Synonyms:
ADENOSINE A3 | ADORA3
Type:
Enzyme Catalytic Domain
Mol. Mass.:
37723.59
Organism:
Chick
Description:
A0A8V1ACC1
Residue:
338
  
Inhibitor
Name:
BDBM82032
Synonyms:
1,3-Dipropyl-3,7-dihydro-purine-2,6-dione CAS_169317 CPX | NSC_169317
Type:
Small organic molecule
Emp. Form.:
C11H16N4O2
Mol. Mass.:
236.2703
SMILES:
CCCn1c2nc[nH]c2c(=O)n(CCC)c1=O
: