Target
Gamma-aminobutyric acid receptor subunit alpha-3
Ligand
BDBM50000766
Substrate
Ki
13.9±n/a nM
Comments
PDSP_656
Citation
 Griebel, GPerrault, GSimiand, JCohen, CGranger, PDecobert, MFrançon, DAvenet, PDepoortere, HTan, SOblin, ASchoemaker, HEvanno, YSevrin, MGeorge, PScatton, B SL651498: an anxioselective compound with functional selectivity for alpha2- and alpha3-containing gamma-aminobutyric acid(A) (GABA(A)) receptors. J Pharmacol Exp Ther 298:753-68 (2001) Target
Name:
Gamma-aminobutyric acid receptor subunit alpha-3
Synonyms:
GABA A anti-Alpha3 GABA receptor alpha-3 subunit Gabra-3 Gamma-aminobutyric acid receptor subunit alpha-3
Type:
Enzyme Catalytic Domain
Mol. Mass.:
55444.88
Organism:
RAT
Description:
GABA A Alpha3Beta2Gamma2 0 RAT::P20236
Residue:
493
  
Inhibitor
Name:
BDBM50000766
Synonyms:
CHEMBL12 US9271961, Diazepam
Type:
Small organic molecule
Emp. Form.:
C16H13ClN2O
Mol. Mass.:
284.74
SMILES:
CN1c2ccc(Cl)cc2C(=NCC1=O)c1ccccc1
: