Target
Voltage-dependent N-type calcium channel subunit alpha-1B
Ligand
BDBM84745
Substrate
Ki
1000±n/a nM
Comments
PDSP_763
Citation
 Bymaster, FPDreshfield-Ahmad, LJThrelkeld, PGShaw, JLThompson, LNelson, DLHemrick-Luecke, SKWong, DT Comparative affinity of duloxetine and venlafaxine for serotonin and norepinephrine transporters in vitro and in vivo, human serotonin receptor subtypes, and other neuronal receptors. Neuropsychopharmacology 25:871-80 (2001)  
Target
Name:
Voltage-dependent N-type calcium channel subunit alpha-1B
Synonyms:
BIII Cach5 Cacnl1a5 Voltage-gated calcium channel subunit alpha Cav2.2 | calcium channel III
Type:
Enzyme Catalytic Domain
Mol. Mass.:
262310.63
Organism:
Rattus norvegicus (Rat)
Description:
Q02294
Residue:
2336
  
Inhibitor
Name:
BDBM84745
Synonyms:
CAS_136434-34-9 LY-248686 USRE49340, Rank 5
Type:
Small organic molecule
Emp. Form.:
C18H19NOS
Mol. Mass.:
297.415
SMILES:
CNCC[C@H](Oc1cccc2ccccc12)c1cccs1
: