Target
D(2) dopamine receptor
Ligand
BDBM81777
Substrate
Ki
3243±n/a nM
Comments
PDSP_1366
Citation
 Kilts, JDConnery, HSArrington, EGLewis, MMLawler, CPOxford, GSO'Malley, KLTodd, RDBlake, BLNichols, DEMailman, RB Functional selectivity of dopamine receptor agonists. II. Actions of dihydrexidine in D2L receptor-transfected MN9D cells and pituitary lactotrophs. J Pharmacol Exp Ther 301:1179-89 (2002)  
Target
Name:
D(2) dopamine receptor
Synonyms:
D(2) dopamine receptor DOPAMINE D2 Long DRD2 Dopamine D2 receptor Dopamine D2 receptor (D2R) Dopamine2-like | d2
Type:
Cell-surface receptors
Mol. Mass.:
50647.10
Organism:
Homo sapiens (Human)
Description:
P14416
Residue:
443
  
Inhibitor
Name:
BDBM81777
Synonyms:
CAS_132-66-1 NPA,(+) NSC_8594
Type:
Small organic molecule
Emp. Form.:
C18H13NO3
Mol. Mass.:
291.3007
SMILES:
OC(=O)c1ccccc1C(=O)Nc1cccc2ccccc12
: