Target
neuronal acetylcholine receptor subunit alpha-2
Ligand
BDBM86040
Substrate
Ki
0.013±n/a nM
Comments
PDSP_2900
Citation
 Avalos, MParker, MJMaddox, FNCarroll, FILuetje, CW Effects of pyridine ring substitutions on affinity, efficacy, and subtype selectivity of neuronal nicotinic receptor agonist epibatidine. J Pharmacol Exp Ther 302:1246-52 (2002)  
Target
Name:
neuronal acetylcholine receptor subunit alpha-2
Synonyms:
Cholinergic, Nicotinic Alpha2Beta2 | Cholinergic, Nicotinic Alpha2Beta4
Type:
Enzyme Catalytic Domain
Mol. Mass.:
59160.03
Organism:
Xenopus
Description:
A0A6I8T284
Residue:
510
  
Inhibitor
Name:
BDBM86040
Synonyms:
NBEP
Type:
Small organic molecule
Emp. Form.:
C11H13BrN2
Mol. Mass.:
253.138
SMILES:
Brc1ccc(cn1)[C@H]1CC2CCC1N2
: