Target
5-hydroxytryptamine receptor 2A
Ligand
BDBM50025206
Substrate
Ki
2344.23±n/a nM
Comments
PDSP_1863
Citation
 Millan, MJMaiofiss, LCussac, DAudinot, VBoutin, JANewman-Tancredi, A Differential actions of antiparkinson agents at multiple classes of monoaminergic receptor. I. A multivariate analysis of the binding profiles of 14 drugs at 21 native and cloned human receptor subtypes. J Pharmacol Exp Ther 303:791-804 (2002)  
Target
Name:
5-hydroxytryptamine receptor 2A
Synonyms:
5-HT-2 5-HT2A 5-hydroxytryptamine receptor 2A (5HT-2A) 5HT2A_HUMAN HTR2A | Serotonin receptor 2A
Type:
undefined
Mol. Mass.:
52607.65
Organism:
Homo sapiens (Human)
Description:
P28223
Residue:
471
  
Inhibitor
Name:
BDBM50025206
Synonyms:
(6,7-Dihydroxy-1,2,3,4-tetrahydro-naphthalen-2-yl)-dimethyl-ammonium | TL99
Type:
Small organic molecule
Emp. Form.:
C12H18NO2
Mol. Mass.:
208.2763
SMILES:
C[NH+](C)C1CCc2cc(O)c(O)cc2C1
: