Target
5-hydroxytryptamine receptor 1B
Ligand
BDBM50022784
Substrate
Ki
1000±n/a nM
Comments
PDSP_3689
Citation
 Bymaster, FPKatner, JSNelson, DLHemrick-Luecke, SKThrelkeld, PGHeiligenstein, JHMorin, SMGehlert, DRPerry, KW Atomoxetine increases extracellular levels of norepinephrine and dopamine in prefrontal cortex of rat: a potential mechanism for efficacy in attention deficit/hyperactivity disorder. Neuropsychopharmacology 27:699-711 (2002)  
Target
Name:
5-hydroxytryptamine receptor 1B
Synonyms:
5-HT-1B 5-HT1B 5HT1B_HUMAN HTR1DB Serotonin (5-HT) receptor Serotonin Receptor 1B
Type:
G Protein-Coupled Receptor (GPCR)
Mol. Mass.:
43579.17
Organism:
Homo sapiens (Human)
Description:
Receptor binding assays were performed using human clone stably expressed in CHO cells
Residue:
390
  
Inhibitor
Name:
BDBM50022784
Synonyms:
(R)-N-methyl-3-phenyl-3-(o-tolyloxy)propan-1-amine CHEMBL641 Methyl-(3-phenyl-3-o-tolyloxy-propyl)-amine Strattera | Tomoxetine
Type:
Small organic molecule
Emp. Form.:
C17H21NO
Mol. Mass.:
255.3547
SMILES:
CNCCC(Oc1ccccc1C)c1ccccc1
: