Target
Muscarinic acetylcholine receptor M2
Ligand
BDBM50022784
Substrate
Ki
1000±n/a nM
Comments
PDSP_3689
Citation
 Bymaster, FPKatner, JSNelson, DLHemrick-Luecke, SKThrelkeld, PGHeiligenstein, JHMorin, SMGehlert, DRPerry, KW Atomoxetine increases extracellular levels of norepinephrine and dopamine in prefrontal cortex of rat: a potential mechanism for efficacy in attention deficit/hyperactivity disorder. Neuropsychopharmacology 27:699-711 (2002)  
Target
Name:
Muscarinic acetylcholine receptor M2
Synonyms:
ACM2_HUMAN Cholinergic, muscarinic M2 Muscarinic acetylcholine receptor M2 and M5 | RecName: Full=Muscarinic acetylcholine receptor M2
Type:
GPCR
Mol. Mass.:
51730.61
Organism:
Homo sapiens (Human)
Description:
P08172
Residue:
466
  
Inhibitor
Name:
BDBM50022784
Synonyms:
(R)-N-methyl-3-phenyl-3-(o-tolyloxy)propan-1-amine CHEMBL641 Methyl-(3-phenyl-3-o-tolyloxy-propyl)-amine Strattera | Tomoxetine
Type:
Small organic molecule
Emp. Form.:
C17H21NO
Mol. Mass.:
255.3547
SMILES:
CNCCC(Oc1ccccc1C)c1ccccc1
: